[ewg] Daily OFED-3.12-20140119-0459 build issue

Nikolova, Tatyana E tatyana.e.nikolova at intel.com
Mon Jan 20 09:46:40 PST 2014


When installing the daily OFED-3.12-20140119-0459 with HPC option, the compat-rdma rpm fails to build. Here is the log information:

CC [M]  /var/tmp/OFED_topdir/BUILD/compat-rdma-3.12/drivers/infiniband/hw/ocrdma/ocrdma_main.o
In file included from /var/tmp/OFED_topdir/BUILD/compat-rdma-3.12/drivers/infiniband/hw/ocrdma/ocrdma_main.c:37:
/var/tmp/OFED_topdir/BUILD/compat-rdma-3.12/drivers/infiniband/hw/ocrdma/ocrdma.h:39:21: error: be_roce.h: No such file or directory
In file included from /var/tmp/OFED_topdir/BUILD/compat-rdma-3.12/drivers/infiniband/hw/ocrdma/ocrdma_main.c:37:
/var/tmp/OFED_topdir/BUILD/compat-rdma-3.12/drivers/infiniband/hw/ocrdma/ocrdma.h:167: error: field 'nic_info' has incomplete type
/var/tmp/OFED_topdir/BUILD/compat-rdma-3.12/drivers/infiniband/hw/ocrdma/ocrdma_main.c: In function 'ocrdma_add':
/var/tmp/OFED_topdir/BUILD/compat-rdma-3.12/drivers/infiniband/hw/ocrdma/ocrdma_main.c:413: error: dereferencing pointer to incomplete type
/var/tmp/OFED_topdir/BUILD/compat-rdma-3.12/drivers/infiniband/hw/ocrdma/ocrdma_main.c:414: error: implicit declaration of function 'idr_alloc'
/var/tmp/OFED_topdir/BUILD/compat-rdma-3.12/drivers/infiniband/hw/ocrdma/ocrdma_main.c: In function 'ocrdma_event_handler':
/var/tmp/OFED_topdir/BUILD/compat-rdma-3.12/drivers/infiniband/hw/ocrdma/ocrdma_main.c:528: error: 'BE_DEV_UP' undeclared (first use in this function)
/var/tmp/OFED_topdir/BUILD/compat-rdma-3.12/drivers/infiniband/hw/ocrdma/ocrdma_main.c:528: error: (Each undeclared identifier is reported only once
/var/tmp/OFED_topdir/BUILD/compat-rdma-3.12/drivers/infiniband/hw/ocrdma/ocrdma_main.c:528: error: for each function it appears in.)
/var/tmp/OFED_topdir/BUILD/compat-rdma-3.12/drivers/infiniband/hw/ocrdma/ocrdma_main.c:531: error: 'BE_DEV_DOWN' undeclared (first use in this function)
/var/tmp/OFED_topdir/BUILD/compat-rdma-3.12/drivers/infiniband/hw/ocrdma/ocrdma_main.c: At top level:
/var/tmp/OFED_topdir/BUILD/compat-rdma-3.12/drivers/infiniband/hw/ocrdma/ocrdma_main.c:537: error: variable 'ocrdma_drv' has initializer but incomplete type
/var/tmp/OFED_topdir/BUILD/compat-rdma-3.12/drivers/infiniband/hw/ocrdma/ocrdma_main.c:538: error: unknown field 'name' specified in initializer
/var/tmp/OFED_topdir/BUILD/compat-rdma-3.12/drivers/infiniband/hw/ocrdma/ocrdma_main.c:538: warning: excess elements in struct initializer
/var/tmp/OFED_topdir/BUILD/compat-rdma-3.12/drivers/infiniband/hw/ocrdma/ocrdma_main.c:538: warning: (near initialization for 'ocrdma_drv')
/var/tmp/OFED_topdir/BUILD/compat-rdma-3.12/drivers/infiniband/hw/ocrdma/ocrdma_main.c:539: error: unknown field 'add' specified in initializer
/var/tmp/OFED_topdir/BUILD/compat-rdma-3.12/drivers/infiniband/hw/ocrdma/ocrdma_main.c:539: warning: excess elements in struct initializer
/var/tmp/OFED_topdir/BUILD/compat-rdma-3.12/drivers/infiniband/hw/ocrdma/ocrdma_main.c:539: warning: (near initialization for 'ocrdma_drv')
/var/tmp/OFED_topdir/BUILD/compat-rdma-3.12/drivers/infiniband/hw/ocrdma/ocrdma_main.c:540: error: unknown field 'remove' specified in initializer
/var/tmp/OFED_topdir/BUILD/compat-rdma-3.12/drivers/infiniband/hw/ocrdma/ocrdma_main.c:540: warning: excess elements in struct initializer
/var/tmp/OFED_topdir/BUILD/compat-rdma-3.12/drivers/infiniband/hw/ocrdma/ocrdma_main.c:540: warning: (near initialization for 'ocrdma_drv')
/var/tmp/OFED_topdir/BUILD/compat-rdma-3.12/drivers/infiniband/hw/ocrdma/ocrdma_main.c:541: error: unknown field 'state_change_handler' specified in initializer
/var/tmp/OFED_topdir/BUILD/compat-rdma-3.12/drivers/infiniband/hw/ocrdma/ocrdma_main.c:541: warning: excess elements in struct initializer
/var/tmp/OFED_topdir/BUILD/compat-rdma-3.12/drivers/infiniband/hw/ocrdma/ocrdma_main.c:541: warning: (near initialization for 'ocrdma_drv')
/var/tmp/OFED_topdir/BUILD/compat-rdma-3.12/drivers/infiniband/hw/ocrdma/ocrdma_main.c: In function 'ocrdma_init_module':
/var/tmp/OFED_topdir/BUILD/compat-rdma-3.12/drivers/infiniband/hw/ocrdma/ocrdma_main.c:561: error: implicit declaration of function 'be_roce_register_driver'
/var/tmp/OFED_topdir/BUILD/compat-rdma-3.12/drivers/infiniband/hw/ocrdma/ocrdma_main.c: In function 'ocrdma_exit_module':
/var/tmp/OFED_topdir/BUILD/compat-rdma-3.12/drivers/infiniband/hw/ocrdma/ocrdma_main.c:570: error: implicit declaration of function 'be_roce_unregister_driver'
make[4]: *** [/var/tmp/OFED_topdir/BUILD/compat-rdma-3.12/drivers/infiniband/hw/ocrdma/ocrdma_main.o] Error 1
make[3]: *** [/var/tmp/OFED_topdir/BUILD/compat-rdma-3.12/drivers/infiniband/hw/ocrdma] Error 2
make[2]: *** [/var/tmp/OFED_topdir/BUILD/compat-rdma-3.12/drivers/infiniband] Error 2
make[1]: *** [_module_/var/tmp/OFED_topdir/BUILD/compat-rdma-3.12] Error 2
make[1]: Leaving directory `/usr/src/kernels/2.6.32-431.el6.x86_64'
make: *** [kernel] Error 2
-------------- next part --------------
An HTML attachment was scrubbed...
URL: <http://lists.openfabrics.org/pipermail/ewg/attachments/20140120/0b935528/attachment-0001.html>


More information about the ewg mailing list